Target
Cyclin-dependent kinase 5 activator 1
Ligand
BDBM50218377
Substrate
Meas. Tech.
ChEMBL_448768 (CHEMBL897914)
IC50
42±n/a nM
Citation
 Shiradkar, MRPadhalingappa, MBBhetalabhotala, SAkula, KCTupe, DAPinninti, RRThummanagoti, S A novel approach to cyclin-dependent kinase 5/p25 inhibitors: A potential treatment for Alzheimer's disease. Bioorg Med Chem 15:6397-406 (2007)  
Target
Name:
Cyclin-dependent kinase 5 activator 1
Synonyms:
CDK5/p35 Cyclin-dependent kinase 5 regulatory subunit 1 | Cyclin-dependent kinase 5/CDK5 activator 1
Type:
Protein Complex
Mol. Mass.:
Description:
Components:
This complex has 2 components.
Component 1
Name:
Cyclin-dependent kinase 5
Synonyms:
CDK5 CDKN5 Cyclin-dependent kinase 5 (CDK5/ p25) Cyclin-dependent-like kinase 5 PSSALRE Tau protein kinase II catalytic subunit
Type:
Enzyme Subunit
Mol. Mass.:
33308.61
Organism:
Homo sapiens (Human)
Description:
Residue:
292
  
Component 2
Name:
Cyclin-dependent kinase 5 activator 1
Synonyms:
CD5R1_HUMAN CDK5R1 Cyclin-dependent kinase 5 (CDK5/p25) NCK5A p35
Type:
Enzyme Subunit
Mol. Mass.:
34077.43
Organism:
Homo sapiens (Human)
Description:
Q15078
Residue:
307
  
Inhibitor
Name:
BDBM50218377
Synonyms:
CHEMBL442239 | N1-[5-(4-amino-5-sulfanyl-4H-1,2,4-triazol-3-yl)-4-phenyl-2-thienyl]-2-chloroacetamide
Type:
Small organic molecule
Emp. Form.:
C14H12ClN5OS2
Mol. Mass.:
365.861
SMILES:
Nn1c(n[nH]c1=S)-c1sc(NC(=O)CCl)cc1-c1ccccc1
: