Target
Neuronal acetylcholine receptor subunit alpha-4/beta-2
Ligand
BDBM50224473
Substrate
Meas. Tech.
ChEMBL_450799 (CHEMBL899886)
EC50
14600±n/a nM
Citation
 Ji, JSchrimpf, MRSippy, KBBunnelle, WHLi, TAnderson, DJFaltynek, CSurowy, CSDyhring, TAhring, PKMeyer, MD Synthesis and structure-activity relationship studies of 3,6-diazabicyclo[3.2.0]heptanes as novel alpha4beta2 nicotinic acetylcholine receptor selective agonists. J Med Chem 50:5493-508 (2007)  
Target
Name:
Neuronal acetylcholine receptor subunit alpha-4/beta-2
Synonyms:
Neuronal acetylcholine receptor Alpha-4/Beta-2 Neuronal acetylcholine receptor; alpha4/beta2 | nAChR subtypes alpha4 beta2
Type:
Protein
Mol. Mass.:
Description:
Components:
This complex has 2 components.
Component 1
Name:
Neuronal acetylcholine receptor subunit alpha-4
Synonyms:
ACHA4_HUMAN CHRNA4 protein Neuronal acetylcholine receptor protein alpha-4 subunit Nicotinic acetylcholine receptor alpha4/beta2/alpha5
Type:
Mol. Mass.:
69963.49
Organism:
Homo sapiens (Human)
Description:
NACHRA4
Residue:
627
  
Component 2
Name:
Neuronal acetylcholine receptor subunit beta-2
Synonyms:
ACHB2_HUMAN Neuronal acetylcholine receptor protein beta-2 subunit | Nicotinic acetylcholine receptor alpha3/beta2/alpha5
Type:
Protein
Mol. Mass.:
57020.50
Organism:
Homo sapiens (Human)
Description:
P17787
Residue:
502
  
Inhibitor
Name:
BDBM50224473
Synonyms:
(1S,5S)-5-(3,6-diaza-bicyclo[3.2.0]hept-3-yl)nicotinonitrile | CHEMBL238667
Type:
Small organic molecule
Emp. Form.:
C11H12N4
Mol. Mass.:
200.2398
SMILES:
N#Cc1cncc(c1)N1C[C@@H]2CN[C@@H]2C1
: