Target
Neuronal acetylcholine receptor subunit alpha-4/beta-2
Ligand
BDBM50224494
Substrate
Meas. Tech.
ChEMBL_450799 (CHEMBL899886)
EC50
7500±n/a nM
Citation
 Ji, JSchrimpf, MRSippy, KBBunnelle, WHLi, TAnderson, DJFaltynek, CSurowy, CSDyhring, TAhring, PKMeyer, MD Synthesis and structure-activity relationship studies of 3,6-diazabicyclo[3.2.0]heptanes as novel alpha4beta2 nicotinic acetylcholine receptor selective agonists. J Med Chem 50:5493-508 (2007)  
Target
Name:
Neuronal acetylcholine receptor subunit alpha-4/beta-2
Synonyms:
Neuronal acetylcholine receptor Alpha-4/Beta-2 Neuronal acetylcholine receptor; alpha4/beta2 | nAChR subtypes alpha4 beta2
Type:
Protein
Mol. Mass.:
Description:
Components:
This complex has 2 components.
Component 1
Name:
Neuronal acetylcholine receptor subunit alpha-4
Synonyms:
ACHA4_HUMAN CHRNA4 protein Neuronal acetylcholine receptor protein alpha-4 subunit Nicotinic acetylcholine receptor alpha4/beta2/alpha5
Type:
Mol. Mass.:
69963.49
Organism:
Homo sapiens (Human)
Description:
NACHRA4
Residue:
627
  
Component 2
Name:
Neuronal acetylcholine receptor subunit beta-2
Synonyms:
ACHB2_HUMAN Neuronal acetylcholine receptor protein beta-2 subunit | Nicotinic acetylcholine receptor alpha3/beta2/alpha5
Type:
Protein
Mol. Mass.:
57020.50
Organism:
Homo sapiens (Human)
Description:
P17787
Residue:
502
  
Inhibitor
Name:
BDBM50224494
Synonyms:
3-{(1R,5S)-3,6-diazabicyclo[3.2.0]heptan-6-yl}-5-cyanopyridine1-oxide | CHEMBL240581
Type:
Small organic molecule
Emp. Form.:
C11H12N4O
Mol. Mass.:
216.2392
SMILES:
[O-][n+]1cc(cc(c1)N1C[C@H]2CNC[C@@H]12)C#N
: