Target
ATP-dependent translocase ABCB1
Ligand
BDBM50305080
Substrate
Meas. Tech.
ChEMBL_458148 (CHEMBL925481)
IC50
331±n/a nM
Citation
 Müller, HKlinkhammer, WGlobisch, CKassack, MUPajeva, IKWiese, M New functional assay of P-glycoprotein activity using Hoechst 33342. Bioorg Med Chem 15:7470-9 (2007)  
Target
Name:
ATP-dependent translocase ABCB1
Synonyms:
ABCB1 MDR1_HUMAN Multidrug resistance protein 1 P-glycoprotein (P-gp) PGY1
Type:
Protein
Mol. Mass.:
141503.50
Organism:
Homo sapiens (Human)
Description:
P08183
Residue:
1280
  
Inhibitor
Name:
BDBM50305080
Synonyms:
CHEMBL247473 N-(2-{4-[2-(6,7-Dimethoxy-3,4-dihydro-1H-isoquinolin-2-yl)-ethyl]-phenylcarbamoyl}-phenyl)-3,4-dimethoxy-benzamide
Type:
Small organic molecule
Emp. Form.:
C35H37N3O6
Mol. Mass.:
595.6848
SMILES:
COc1ccc(cc1OC)C(=O)Nc1ccccc1C(=O)Nc1ccc(CCN2CCc3cc(OC)c(OC)cc3C2)cc1
: