Target
C-C chemokine receptor type 8
Ligand
BDBM50414967
Substrate
Meas. Tech.
ChEMBL_465785 (CHEMBL948147)
IC50
18±n/a nM
Citation
 Shamovsky, IConnolly, SDavid, LIvanova, SNordén, BSpringthorpe, BUrbahns, K Overcoming undesirable HERG potency of chemokine receptor antagonists using baseline lipophilicity relationships. J Med Chem 51:1162-78 (2008)  
Target
Name:
C-C chemokine receptor type 8
Synonyms:
CCR8 CKRL1 CMKBRL2
Type:
PROTEIN
Mol. Mass.:
40855.53
Organism:
Homo sapiens (Human)
Description:
ChEMBL_454278
Residue:
355
  
Inhibitor
Name:
BDBM50414967
Synonyms:
CHEMBL271801
Type:
Small organic molecule
Emp. Form.:
C28H31N3O2
Mol. Mass.:
441.5646
SMILES:
O=C(N1CCC2(CCN(Cc3cccc(Oc4ccccc4)c3)CC2)CC1)c1ccncc1
: