Target
11-beta-hydroxysteroid dehydrogenase 1
Ligand
BDBM50411937
Substrate
Meas. Tech.
ChEMBL_474247 (CHEMBL934096)
IC50
72.44±n/a nM
Citation
 Lee, JHKang, NSYoo, SE Docking-based 3D-QSAR study for 11beta-HSD1 inhibitors. Bioorg Med Chem Lett 18:2479-90 (2008)  
Target
Name:
11-beta-hydroxysteroid dehydrogenase 1
Synonyms:
11-DH 11-beta-Hydroxysteroid Dehydrogenase 1 (11-beta-HSD1) 11-beta-hydroxysteroid dehydrogenase 1 (11HSD1) Corticosteroid 11-beta-dehydrogenase isozyme 1 (11-beta-HSD-1) Corticosteroid 11-beta-dehydrogenase isozyme 1 (11beta-HSD1) HSD11 HSD11L | SDR26C1
Type:
Enzyme
Mol. Mass.:
32409.16
Organism:
Homo sapiens (Human)
Description:
P28845
Residue:
292
  
Inhibitor
Name:
BDBM50411937
Synonyms:
CHEMBL404186
Type:
Small organic molecule
Emp. Form.:
C17H27N3
Mol. Mass.:
273.4164
SMILES:
CCCCn1c(C)nnc1C12CC3CC(CC(C3)C1)C2
: