Target
7-dehydrocholesterol reductase
Ligand
BDBM50412078
Substrate
Meas. Tech.
ChEMBL_550766 (CHEMBL1008660)
IC50
>20000±n/a nM
Citation
 Chang, LCBhat, KPPisha, EKennelly, EJFong, HHPezzuto, JMKinghorn, AD Activity-guided isolation of steroidal alkaloid antiestrogen-binding site inhibitors from Pachysandra procumbens. J Nat Prod 61:1257-62 (1998)  
Target
Name:
7-dehydrocholesterol reductase
Synonyms:
7-DHC reductase Anti-estrogen binding site (AEBS) DHCR7 Putative sterol reductase SR-2 | Sterol Delta(7)-reductase
Type:
PROTEIN
Mol. Mass.:
54508.42
Organism:
Homo sapiens (Human)
Description:
ChEMBL_864350
Residue:
475
  
Inhibitor
Name:
BDBM50412078
Synonyms:
EPIPACHYSAMINE D
Type:
Small organic molecule
Emp. Form.:
C30H46N2O
Mol. Mass.:
450.699
SMILES:
C[C@@H]([C@H]1CC[C@H]2[C@@H]3CC[C@H]4C[C@H](CC[C@]4(C)[C@H]3CC[C@]12C)NC(=O)c1ccccc1)N(C)C
: