Target
Adenosine receptor A1
Ligand
BDBM50196003
Substrate
Meas. Tech.
ChEMBL_530419 (CHEMBL972184)
Ki
6700388.74±n/a nM
Citation
 Massarelli, ICoi, APietra, DNofal, FABiagi, GGiorgi, ILeonardi, MFiamingo, FBianucci, AM QSAR study on a novel series of 8-azaadenine analogues proposed as A1 adenosine receptor antagonists. Eur J Med Chem 43:114-21 (2008)  
Target
Name:
Adenosine receptor A1
Synonyms:
AA1R_BOVIN ADENOSINE A1 high ADORA1 | Adenosine A1 receptor
Type:
Enzyme Catalytic Domain
Mol. Mass.:
36602.99
Organism:
BOVINE
Description:
ADENOSINE 0 BOVINE::P28190
Residue:
326
  
Inhibitor
Name:
BDBM50196003
Synonyms:
3-(2-fluorobenzyl)-N-cyclopentyl-5-phenyl-3H-[1,2,3]triazolo[4,5-d]pyrimidin-7-amine | CHEMBL388520
Type:
Small organic molecule
Emp. Form.:
C22H21FN6
Mol. Mass.:
388.4407
SMILES:
Fc1ccccc1Cn1nnc2c(NC3CCCC3)nc(nc12)-c1ccccc1
: