Target
Adenosine receptor A1
Ligand
BDBM50195998
Substrate
Meas. Tech.
ChEMBL_530419 (CHEMBL972184)
Ki
15000301.9±n/a nM
Citation
 Massarelli, ICoi, APietra, DNofal, FABiagi, GGiorgi, ILeonardi, MFiamingo, FBianucci, AM QSAR study on a novel series of 8-azaadenine analogues proposed as A1 adenosine receptor antagonists. Eur J Med Chem 43:114-21 (2008)  
Target
Name:
Adenosine receptor A1
Synonyms:
AA1R_BOVIN ADENOSINE A1 high ADORA1 | Adenosine A1 receptor
Type:
Enzyme Catalytic Domain
Mol. Mass.:
36602.99
Organism:
BOVINE
Description:
ADENOSINE 0 BOVINE::P28190
Residue:
326
  
Inhibitor
Name:
BDBM50195998
Synonyms:
3-(2-fluorobenzyl)-N-cyclopropyl-5-phenyl-3H-[1,2,3]triazolo[4,5-d]pyrimidin-7-amine | CHEMBL227798
Type:
Small organic molecule
Emp. Form.:
C20H17FN6
Mol. Mass.:
360.3876
SMILES:
Fc1ccccc1Cn1nnc2c(NC3CC3)nc(nc12)-c1ccccc1
: