Target
Muscarinic acetylcholine receptor M1
Ligand
BDBM50412313
Substrate
Meas. Tech.
ChEMBL_491018 (CHEMBL982066)
Ki
6.31±n/a nM
Citation
 Minarini, AMarucci, GBellucci, CGiorgi, GTumiatti, VBolognesi, MLMatera, RRosini, MMelchiorre, C Design, synthesis, and biological evaluation of pirenzepine analogs bearing a 1,2-cyclohexanediamine and perhydroquinoxaline units in exchange for the piperazine ring as antimuscarinics. Bioorg Med Chem 16:7311-20 (2008)  
Target
Name:
Muscarinic acetylcholine receptor M1
Synonyms:
ACM1_HUMAN Cholinergic receptor, muscarinic 1 | Cholinergic, muscarinic M1
Type:
Protein
Mol. Mass.:
51442.54
Organism:
Homo sapiens (Human)
Description:
P11229
Residue:
460
  
Inhibitor
Name:
BDBM50412313
Synonyms:
CHEMBL2021478
Type:
Small organic molecule
Emp. Form.:
C24H30N4O2
Mol. Mass.:
406.5206
SMILES:
CN(C)[C@@H]1CCCC[C@@H]1N(C)CC(=O)N1c2ccccc2NC(=O)c2ccccc12
: