Target
Muscarinic acetylcholine receptor M2
Ligand
BDBM50412310
Substrate
Meas. Tech.
ChEMBL_491019 (CHEMBL982067)
Ki
645.65±n/a nM
Citation
 Minarini, AMarucci, GBellucci, CGiorgi, GTumiatti, VBolognesi, MLMatera, RRosini, MMelchiorre, C Design, synthesis, and biological evaluation of pirenzepine analogs bearing a 1,2-cyclohexanediamine and perhydroquinoxaline units in exchange for the piperazine ring as antimuscarinics. Bioorg Med Chem 16:7311-20 (2008)  
Target
Name:
Muscarinic acetylcholine receptor M2
Synonyms:
ACM2_HUMAN Cholinergic, muscarinic M2 Muscarinic acetylcholine receptor M2 and M5 | RecName: Full=Muscarinic acetylcholine receptor M2
Type:
GPCR
Mol. Mass.:
51730.61
Organism:
Homo sapiens (Human)
Description:
P08172
Residue:
466
  
Inhibitor
Name:
BDBM50412310
Synonyms:
CHEMBL478227
Type:
Small organic molecule
Emp. Form.:
C23H27N5O2
Mol. Mass.:
405.4928
SMILES:
CN1CCN(CC(=O)N2c3ccccc3C(=O)Nc3cccnc23)[C@@H]2CCCC[C@H]12
: