Target
cGMP-specific 3',5'-cyclic phosphodiesterase
Ligand
BDBM50287550
Substrate
Meas. Tech.
ChEMBL_514120 (CHEMBL968866)
IC50
1.9±n/a nM
Citation
 Antunes, JEFreitas, MPda Cunha, EFRamalho, TCRittner, R In silico prediction of novel phosphodiesterase type-5 inhibitors derived from Sildenafil, Vardenafil and Tadalafil. Bioorg Med Chem 16:7599-606 (2008)  
Target
Name:
cGMP-specific 3',5'-cyclic phosphodiesterase
Synonyms:
3',5'-cyclic phosphodiesterase PDE5 PDE5A_HUMAN Phosphodiesterase 5 (PDE5) Phosphodiesterase 5A (PDE5A) cGMP-specific 3',5'-cyclic phosphodiesterase
Type:
Protein
Mol. Mass.:
99975.83
Organism:
Homo sapiens (Human)
Description:
O76074
Residue:
875
  
Inhibitor
Name:
BDBM50287550
Synonyms:
5-(2-ethoxy-5-(4-(2-hydroxyethyl)piperazin-1-ylsulfonyl)phenyl)-1-methyl-3-propyl-1H-pyrazolo[4,3-d]pyrimidin-7(6H)-one CHEMBL53538
Type:
Small organic molecule
Emp. Form.:
C23H32N6O5S
Mol. Mass.:
504.602
SMILES:
CCCc1nn(C)c2c1nc([nH]c2=O)-c1cc(ccc1OCC)S(=O)(=O)N1CCN(CCO)CC1
: