Target
3-oxoacyl-[acyl-carrier-protein] synthase 3
Ligand
BDBM23597
Substrate
Meas. Tech.
ChEMBL_510888 (CHEMBL997780)
IC50
2098.94±n/a nM
Citation
 Singh, SSoni, LKGupta, MKPrabhakar, YSKaskhedikar, SG QSAR studies on benzoylaminobenzoic acid derivatives as inhibitors of beta-ketoacyl-acyl carrier protein synthase III. Eur J Med Chem 43:1071-80 (2008)  
Target
Name:
3-oxoacyl-[acyl-carrier-protein] synthase 3
Synonyms:
3-oxoacyl-[acyl-carrier-protein] synthase 3 Beta-ketoacyl-ACP synthase III KAS III fabH
Type:
Acyltransferase; homodimer
Mol. Mass.:
35176.53
Organism:
Enterococcus faecalis
Description:
The E. faecalis FabH was cloned, and protein was expressed in E. coli.
Residue:
321
  
Inhibitor
Name:
BDBM23597
Synonyms:
(3-Phenoxybenzoylamino)benzoic acid deriv., 24f | 4-{4-[(2-carboxyphenyl)carbamoyl]-2-phenoxyphenyl}benzoic acid
Type:
Small organic molecule
Emp. Form.:
C27H19NO6
Mol. Mass.:
453.4429
SMILES:
OC(=O)c1ccc(cc1)-c1ccc(cc1Oc1ccccc1)C(=O)Nc1ccccc1C(O)=O
: