Target
Broad substrate specificity ATP-binding cassette transporter ABCG2
Ligand
BDBM50375813
Substrate
Meas. Tech.
ChEMBL_512910 (CHEMBL974467)
IC50
676.08±n/a nM
Citation
 Pick, AMüller, HWiese, M Structure-activity relationships of new inhibitors of breast cancer resistance protein (ABCG2). Bioorg Med Chem 16:8224-36 (2008)  
Target
Name:
Broad substrate specificity ATP-binding cassette transporter ABCG2
Synonyms:
ABCG2 ABCP ATP-binding cassette sub-family G member 2 ATP-binding cassette, sub-family G, member 2 BCRP1 CDw338 Mitoxantrone resistance-associated protein Urate exporter
Type:
Multi-pass membrane protein; monomer or homodimer; disulfide-linked
Mol. Mass.:
72329.48
Organism:
Homo sapiens (Human)
Description:
Q9UNQ0
Residue:
655
  
Inhibitor
Name:
BDBM50375813
Synonyms:
CHEMBL428402 | XR-9577
Type:
Small organic molecule
Emp. Form.:
C34H30N4O2
Mol. Mass.:
526.6276
SMILES:
O=C(Nc1ccccc1C(=O)Nc1ccc(CCN2CCc3ccccc3C2)cc1)c1cnc2ccccc2c1
: