Target
Histamine H4 receptor
Ligand
BDBM50412517
Substrate
Meas. Tech.
ChEMBL_556996 (CHEMBL958182)
Ki
371.54±n/a nM
Citation
 Smits, RAde Esch, IJZuiderveld, OPBroeker, JSansuk, KGuaita, ECoruzzi, GAdami, MHaaksma, ELeurs, R Discovery of quinazolines as histamine H4 receptor inverse agonists using a scaffold hopping approach. J Med Chem 51:7855-65 (2008)  
Target
Name:
Histamine H4 receptor
Synonyms:
AXOR35 GPCR105 HH4R HRH4 Histamine H4 receptor Histamine receptor (H3 and H4) SP9144
Type:
G Protein-Coupled Receptor (GPCR)
Mol. Mass.:
44517.02
Organism:
Homo sapiens (Human)
Description:
Binding assays were using CHO cells stably expressing hH4R receptors.
Residue:
390
  
Inhibitor
Name:
BDBM50412517
Synonyms:
CHEMBL452870 | VUF-10511
Type:
Small organic molecule
Emp. Form.:
C17H20ClN7O
Mol. Mass.:
373.84
SMILES:
CN1CCN(CC1)c1nc(NCc2nc(C)no2)c2cc(Cl)ccc2n1
: