Target
Calcium-activated potassium channel subunit alpha-1
Ligand
BDBM50412643
Substrate
Meas. Tech.
ChEMBL_558735 (CHEMBL954137)
IC50
2511.89±n/a nM
Citation
 Coi, AFiamingo, FLLivi, OCalderone, VMartelli, AMassarelli, IBianucci, AM QSAR studies on BK channel activators. Bioorg Med Chem 17:319-25 (2008)  
Target
Name:
Calcium-activated potassium channel subunit alpha-1
Synonyms:
Calcium-activated potassium channel alpha/beta 1 KCNMA Large conductance calcium-activated potassium channel subfamily M alpha member 1 isoform b | SLO
Type:
PROTEIN
Mol. Mass.:
137567.62
Organism:
Homo sapiens (Human)
Description:
ChEMBL_938830
Residue:
1236
  
Inhibitor
Name:
BDBM50412643
Synonyms:
CHEMBL499800
Type:
Small organic molecule
Emp. Form.:
C14H12N2O4
Mol. Mass.:
272.2561
SMILES:
Cc1ccc(NC(=O)c2ccccc2O)c(c1)[N+]([O-])=O
: