Target
Calcium-activated potassium channel subunit alpha-1
Ligand
BDBM50412661
Substrate
Meas. Tech.
ChEMBL_558735 (CHEMBL954137)
IC50
13803.84±n/a nM
Citation
 Coi, AFiamingo, FLLivi, OCalderone, VMartelli, AMassarelli, IBianucci, AM QSAR studies on BK channel activators. Bioorg Med Chem 17:319-25 (2008)  
Target
Name:
Calcium-activated potassium channel subunit alpha-1
Synonyms:
Calcium-activated potassium channel alpha/beta 1 KCNMA Large conductance calcium-activated potassium channel subfamily M alpha member 1 isoform b | SLO
Type:
PROTEIN
Mol. Mass.:
137567.62
Organism:
Homo sapiens (Human)
Description:
ChEMBL_938830
Residue:
1236
  
Inhibitor
Name:
BDBM50412661
Synonyms:
CHEMBL464052
Type:
Small organic molecule
Emp. Form.:
C10H9N7O
Mol. Mass.:
243.2248
SMILES:
Cc1ccc2n(nnc2c1)-c1nn[nH]c1C(N)=O
: