Target
Growth hormone secretagogue receptor type 1
Ligand
BDBM50412954
Substrate
Meas. Tech.
ChEMBL_515971 (CHEMBL994776)
EC50
0.158±n/a nM
Citation
 Witherington, JAbberley, LBellenie, BRBoatman, RCollis, KDean, DKGaiba, AKing, NPShuker, NSteadman, JGTakle, AKSanger, GButler, SMcKay, FMuir, AWinborn, KWard, RWHeightman, TD Aryl sulphonyl amides as potent agonists of the growth hormone secretagogue (ghrelin) receptor. Bioorg Med Chem Lett 19:684-7 (2009)  
Target
Name:
Growth hormone secretagogue receptor type 1
Synonyms:
GH-releasing peptide receptor GHS-R GHSR_HUMAN Ghrelin receptor | Ghrelin receptor 1a (GHS-R1a)
Type:
Receptor
Mol. Mass.:
41334.57
Organism:
Homo sapiens (Human)
Description:
Receptor binding studies use plasma membranes from LLC PK-1 cells transiently transfected with hGHSR1a.
Residue:
366
  
Inhibitor
Name:
BDBM50412954
Synonyms:
CHEMBL251572 SB-791016A
Type:
Small organic molecule
Emp. Form.:
C24H28N4O3S2
Mol. Mass.:
484.634
SMILES:
COc1cc2CCN(c2cc1N1C[C@H](C)N[C@H](C)C1)S(=O)(=O)c1ccc(s1)-c1ccccn1
: