Target
Growth hormone secretagogue receptor type 1
Ligand
BDBM50412972
Substrate
Meas. Tech.
ChEMBL_515971 (CHEMBL994776)
EC50
0.316±n/a nM
Citation
 Witherington, JAbberley, LBellenie, BRBoatman, RCollis, KDean, DKGaiba, AKing, NPShuker, NSteadman, JGTakle, AKSanger, GButler, SMcKay, FMuir, AWinborn, KWard, RWHeightman, TD Aryl sulphonyl amides as potent agonists of the growth hormone secretagogue (ghrelin) receptor. Bioorg Med Chem Lett 19:684-7 (2009)  
Target
Name:
Growth hormone secretagogue receptor type 1
Synonyms:
GH-releasing peptide receptor GHS-R GHSR_HUMAN Ghrelin receptor | Ghrelin receptor 1a (GHS-R1a)
Type:
Receptor
Mol. Mass.:
41334.57
Organism:
Homo sapiens (Human)
Description:
Receptor binding studies use plasma membranes from LLC PK-1 cells transiently transfected with hGHSR1a.
Residue:
366
  
Inhibitor
Name:
BDBM50412972
Synonyms:
CHEMBL482220
Type:
Small organic molecule
Emp. Form.:
C22H25Cl2N3O3S
Mol. Mass.:
482.423
SMILES:
N[C@@H]1CCN(C1)C(=O)[C@@H]1CCCCN1S(=O)(=O)c1ccc(cc1)-c1cc(Cl)ccc1Cl
: