Target
5-hydroxytryptamine receptor 6
Ligand
BDBM50412984
Substrate
Meas. Tech.
ChEMBL_516616 (CHEMBL991392)
Ki
832±n/a nM
Citation
 Wroblowski, BWigglesworth, MJSzekeres, PGSmith, GDRahman, SSNicholson, NHMuir, AIHall, AHeer, JPGarland, SLCoates, WJ The discovery of a selective, small molecule agonist for the MAS-related gene X1 receptor. J Med Chem 52:818-25 (2009)  
Target
Name:
5-hydroxytryptamine receptor 6
Synonyms:
5-HT-6 5-hydroxytryptamine receptor 6 (5-HT-6) 5-hydroxytryptamine receptor 6 (5HT6) HTR6 Serotonin 6 (5-HT6) receptor | Serotonin Receptor 6
Type:
G Protein-Coupled Receptor (GPCR)
Mol. Mass.:
46968.43
Organism:
Homo sapiens (Human)
Description:
P50406
Residue:
440
  
Inhibitor
Name:
BDBM50412984
Synonyms:
CHEMBL458002
Type:
Small organic molecule
Emp. Form.:
C29H28ClN5O2
Mol. Mass.:
514.018
SMILES:
Cc1ccc(Cn2ncc(N3CCNCC3)c(Cl)c2=O)cc1NC(=O)c1ccc(cc1)-c1ccccc1
: