Target
Prostaglandin G/H synthase 2
Ligand
BDBM50094561
Substrate
Meas. Tech.
ChEMBL_497297 (CHEMBL995859)
IC50
4.51±n/a nM
Citation
 Silakari, PShrivastava, SDSilakari, GKohli, DVRambabu, GSrivastava, SShrivastava, SKSilakari, O QSAR analysis of 1,3-diaryl-4,5,6,7-tetrahydro-2H-isoindole derivatives as selective COX-2 inhibitors. Eur J Med Chem 43:1559-69 (2008)  
Target
Name:
Prostaglandin G/H synthase 2
Synonyms:
Cox-2 Cyclooxygenase-2 Glucocorticoid-regulated inflammatory cyclooxygenase Macrophage activation-associated marker protein P71/73 PGH synthase 2 PGHS-2 Pghs-b Prostaglandin H2 synthase 2 Ptgs2 Tis10
Type:
Protein
Mol. Mass.:
69020.39
Organism:
Mus musculus (Mouse)
Description:
Q05769
Residue:
604
  
Inhibitor
Name:
BDBM50094561
Synonyms:
3,5-Bis-(4-fluoro-phenyl)-4-aza-tricyclo[5.2.1.0*2,6*]deca-2,5,8-triene | CHEMBL139721
Type:
Small organic molecule
Emp. Form.:
C21H15F2N
Mol. Mass.:
319.3473
SMILES:
Fc1ccc(cc1)-c1[nH]c(c2C3CC(C=C3)c12)-c1ccc(F)cc1
: