Target
Prostaglandin G/H synthase 2
Ligand
BDBM50094540
Substrate
Meas. Tech.
ChEMBL_497297 (CHEMBL995859)
IC50
1.5±n/a nM
Citation
 Silakari, PShrivastava, SDSilakari, GKohli, DVRambabu, GSrivastava, SShrivastava, SKSilakari, O QSAR analysis of 1,3-diaryl-4,5,6,7-tetrahydro-2H-isoindole derivatives as selective COX-2 inhibitors. Eur J Med Chem 43:1559-69 (2008)  
Target
Name:
Prostaglandin G/H synthase 2
Synonyms:
Cox-2 Cyclooxygenase-2 Glucocorticoid-regulated inflammatory cyclooxygenase Macrophage activation-associated marker protein P71/73 PGH synthase 2 PGHS-2 Pghs-b Prostaglandin H2 synthase 2 Ptgs2 Tis10
Type:
Protein
Mol. Mass.:
69020.39
Organism:
Mus musculus (Mouse)
Description:
Q05769
Residue:
604
  
Inhibitor
Name:
BDBM50094540
Synonyms:
1,3-diphenyl-4,5,6,7-tetrahydro-2H-isoindole | CHEMBL344085
Type:
Small organic molecule
Emp. Form.:
C20H19N
Mol. Mass.:
273.3716
SMILES:
C1CCc2c(C1)c([nH]c2-c1ccccc1)-c1ccccc1
: