Target
Retinoic acid receptor beta
Ligand
BDBM50413266
Substrate
Meas. Tech.
ChEMBL_542833 (CHEMBL1022110)
EC50
125.89±n/a nM
Citation
 Lund, BWKnapp, AEPiu, FGauthier, NKBegtrup, MHacksell, UOlsson, R Design, synthesis, and structure-activity analysis of isoform-selective retinoic acid receptor beta ligands. J Med Chem 52:1540-5 (2009)  
Target
Name:
Retinoic acid receptor beta
Synonyms:
HAP NR1B2 RAR-beta RARB Retinoic acid receptor RXR-alpha/Retinoic acid receptor beta Retinoid receptor
Type:
PROTEIN
Mol. Mass.:
50498.70
Organism:
Homo sapiens (Human)
Description:
ChEMBL_1458015
Residue:
455
  
Inhibitor
Name:
BDBM50413266
Synonyms:
CHEMBL471197
Type:
Small organic molecule
Emp. Form.:
C20H23FO2
Mol. Mass.:
314.3938
SMILES:
CCCCCCCc1ccc(cc1)-c1ccc(C(O)=O)c(F)c1
: