Target
cAMP-specific 3',5'-cyclic phosphodiesterase 4B
Ligand
BDBM50413285
Substrate
Meas. Tech.
ChEMBL_565939 (CHEMBL960834)
IC50
19.95±n/a nM
Citation
 Lunniss, CJCooper, AWEldred, CDKranz, MLindvall, MLucas, FSNeu, MPreston, AGRanshaw, LERedgrave, AJEd Robinson, JShipley, TJSolanke, YESomers, DOWiseman, JO Quinolines as a novel structural class of potent and selective PDE4 inhibitors: optimisation for oral administration. Bioorg Med Chem Lett 19:1380-5 (2009)  
Target
Name:
cAMP-specific 3',5'-cyclic phosphodiesterase 4B
Synonyms:
3',5'-cyclic phosphodiesterase Isoform PDE4B1 PDE4B PDE4B_HUMAN Phosphodiesterase 4B (PDE4B) Phosphodiesterase Type 4 (PDE4B)
Type:
Protein
Mol. Mass.:
83318.87
Organism:
Homo sapiens (Human)
Description:
Q07343
Residue:
736
  
Inhibitor
Name:
BDBM50413285
Synonyms:
CHEMBL463418
Type:
Small organic molecule
Emp. Form.:
C18H14N4O3S
Mol. Mass.:
366.394
SMILES:
CS(=O)(=O)c1ccc2ncc(C(N)=O)c(Nc3cccc(c3)C#N)c2c1
: