Target
cAMP-specific 3',5'-cyclic phosphodiesterase 4B
Ligand
BDBM50413296
Substrate
Meas. Tech.
ChEMBL_565939 (CHEMBL960834)
IC50
0.316±n/a nM
Citation
 Lunniss, CJCooper, AWEldred, CDKranz, MLindvall, MLucas, FSNeu, MPreston, AGRanshaw, LERedgrave, AJEd Robinson, JShipley, TJSolanke, YESomers, DOWiseman, JO Quinolines as a novel structural class of potent and selective PDE4 inhibitors: optimisation for oral administration. Bioorg Med Chem Lett 19:1380-5 (2009)  
Target
Name:
cAMP-specific 3',5'-cyclic phosphodiesterase 4B
Synonyms:
3',5'-cyclic phosphodiesterase Isoform PDE4B1 PDE4B PDE4B_HUMAN Phosphodiesterase 4B (PDE4B) Phosphodiesterase Type 4 (PDE4B)
Type:
Protein
Mol. Mass.:
83318.87
Organism:
Homo sapiens (Human)
Description:
Q07343
Residue:
736
  
Inhibitor
Name:
BDBM50413296
Synonyms:
CHEMBL473764
Type:
Small organic molecule
Emp. Form.:
C19H18FN3O4S
Mol. Mass.:
403.427
SMILES:
COc1cc(Nc2c(cnc3c(C)cc(cc23)S(C)(=O)=O)C(N)=O)ccc1F
: