Target
Mas-related G-protein coupled receptor member X1
Ligand
BDBM50413335
Substrate
Meas. Tech.
ChEMBL_562318 (CHEMBL1015292)
EC50
1258.93±n/a nM
Citation
 Malik, LKelly, NMMa, JNCurrier, EABurstein, ESOlsson, R Discovery of non-peptidergic MrgX1 and MrgX2 receptor agonists and exploration of an initial SAR using solid-phase synthesis. Bioorg Med Chem Lett 19:1729-32 (2009)  
Target
Name:
Mas-related G-protein coupled receptor member X1
Synonyms:
MRGPRX1 MRGX1_HUMAN SNSR4
Type:
PROTEIN
Mol. Mass.:
36253.68
Organism:
Homo sapiens (Human)
Description:
ChEMBL_516621
Residue:
322
  
Inhibitor
Name:
BDBM50413335
Synonyms:
CHEMBL474761
Type:
Small organic molecule
Emp. Form.:
C36H42FN7O2
Mol. Mass.:
623.7628
SMILES:
CC(C)C1C(=O)Nc2ccc(NCCN3CCCCC3)cc2-c2nc3cc(ccc3n12)C(=O)N1CCN(CC1)c1ccc(F)cc1
: