Target
Mas-related G-protein coupled receptor member X1
Ligand
BDBM50413337
Substrate
Meas. Tech.
ChEMBL_562318 (CHEMBL1015292)
EC50
794.33±n/a nM
Citation
 Malik, LKelly, NMMa, JNCurrier, EABurstein, ESOlsson, R Discovery of non-peptidergic MrgX1 and MrgX2 receptor agonists and exploration of an initial SAR using solid-phase synthesis. Bioorg Med Chem Lett 19:1729-32 (2009)  
Target
Name:
Mas-related G-protein coupled receptor member X1
Synonyms:
MRGPRX1 MRGX1_HUMAN SNSR4
Type:
PROTEIN
Mol. Mass.:
36253.68
Organism:
Homo sapiens (Human)
Description:
ChEMBL_516621
Residue:
322
  
Inhibitor
Name:
BDBM50413337
Synonyms:
BAM-22 | CHEMBL506128
Type:
Small organic molecule
Emp. Form.:
C130H184N38O31S2
Mol. Mass.:
2839.218
SMILES:
CSCCC(NC(=O)C(Cc1c[nH]c2ccccc12)NC(=O)C(Cc1c[nH]c2ccccc12)NC(=O)C(CCC(O)=O)NC(=O)C1CCCN1C(=O)C(CCCN=C(N)N)NC(=O)CNC(=O)C(NC(=O)C(CCCN=C(N)N)NC(=O)C(CCCN=C(N)N)NC(=O)C(CCSC)NC(=O)C(Cc1ccccc1)NC(=O)CNC(=O)CNC(=O)C(N)Cc1ccc(O)cc1)C(C)C)C(=O)NC(CC(O)=O)C(=O)NC(Cc1ccc(O)cc1)C(=O)NC(CCC(N)=O)C(=O)NC(CCCCN)C(=O)NC(CCCN=C(N)N)C(=O)NC(Cc1ccc(O)cc1)C(=O)NCC(O)=O
: