Target
Mas-related G-protein coupled receptor member X1
Ligand
BDBM50413342
Substrate
Meas. Tech.
ChEMBL_562318 (CHEMBL1015292)
EC50
316.23±n/a nM
Citation
 Malik, LKelly, NMMa, JNCurrier, EABurstein, ESOlsson, R Discovery of non-peptidergic MrgX1 and MrgX2 receptor agonists and exploration of an initial SAR using solid-phase synthesis. Bioorg Med Chem Lett 19:1729-32 (2009)  
Target
Name:
Mas-related G-protein coupled receptor member X1
Synonyms:
MRGPRX1 MRGX1_HUMAN SNSR4
Type:
PROTEIN
Mol. Mass.:
36253.68
Organism:
Homo sapiens (Human)
Description:
ChEMBL_516621
Residue:
322
  
Inhibitor
Name:
BDBM50413342
Synonyms:
CHEMBL466116
Type:
Small organic molecule
Emp. Form.:
C34H39F3N6O4
Mol. Mass.:
652.7065
SMILES:
CC[C@@H](C)[C@@H]1C(=O)Nc2ccc(NCCOCCOCCN)cc2-c2nc3cc(ccc3n12)C(=O)NCc1cccc(c1)C(F)(F)F
: