Target
Neuronal acetylcholine receptor subunit alpha-4
Ligand
BDBM50187449
Substrate
Meas. Tech.
ChEMBL_562743 (CHEMBL1022415)
EC50
1412.54±n/a nM
Citation
 Tosco, PAhring, PKDyhring, TPeters, DHarpsøe, KLiljefors, TBalle, T Complementary three-dimensional quantitative structure-activity relationship modeling of binding affinity and functional potency: a study on alpha4beta2 nicotinic ligands. J Med Chem 52:2311-6 (2009)  
Target
Name:
Neuronal acetylcholine receptor subunit alpha-4
Synonyms:
ACHA4_HUMAN CHRNA4 protein Neuronal acetylcholine receptor protein alpha-4 subunit Nicotinic acetylcholine receptor alpha4/beta2/alpha5
Type:
Mol. Mass.:
69963.49
Organism:
Homo sapiens (Human)
Description:
NACHRA4
Residue:
627
  
Inhibitor
Name:
BDBM50187449
Synonyms:
(+/-)-3-chloro-5-(piperidin-3-yloxy)-pyridine CHEMBL208754
Type:
Small organic molecule
Emp. Form.:
C10H13ClN2O
Mol. Mass.:
212.676
SMILES:
Clc1cncc(OC2CCCNC2)c1
: