Target
5-hydroxytryptamine receptor 1A
Ligand
BDBM50413687
Substrate
Meas. Tech.
ChEMBL_540308 (CHEMBL1035839)
Ki
2±n/a nM
Citation
 Ward, SEEddershaw, PFlynn, STGordon, LLovell, PJMoore, SHScott, CMSmith, PWThewlis, KMWyman, PA Studies on a series of potent, orally bioavailable, 5-HT(1) receptor ligands--part II. Bioorg Med Chem Lett 19:428-32 (2008)  
Target
Name:
5-hydroxytryptamine receptor 1A
Synonyms:
5-HT-1A 5-hydroxytryptamine receptor 1A (5-HT-1A) ADRB2RL1 Dopamine D2 receptor and serotonin 1a receptor HTR1A | Serotonin receptor 1A
Type:
Mol. Mass.:
46122.49
Organism:
Homo sapiens (Human)
Description:
Residue:
422
  
Inhibitor
Name:
BDBM50413687
Synonyms:
CHEMBL461670
Type:
Small organic molecule
Emp. Form.:
C30H40N4O
Mol. Mass.:
472.6648
SMILES:
C[C@H]1CN(C[C@@H](C)N1)c1cccc(CC2CCN(CCOc3cccc4nc(C)ccc34)CC2)c1
: