Target
5-hydroxytryptamine receptor 1D
Ligand
BDBM50413694
Substrate
Meas. Tech.
ChEMBL_540312 (CHEMBL1035843)
Ki
1±n/a nM
Citation
 Ward, SEEddershaw, PFlynn, STGordon, LLovell, PJMoore, SHScott, CMSmith, PWThewlis, KMWyman, PA Studies on a series of potent, orally bioavailable, 5-HT(1) receptor ligands--part II. Bioorg Med Chem Lett 19:428-32 (2008)  
Target
Name:
5-hydroxytryptamine receptor 1D
Synonyms:
5-HT-1D 5-HT1D 5HT1D_HUMAN HTR1DA Serotonin (5-HT) receptor | Serotonin Receptor 1D
Type:
G Protein-Coupled Receptor (GPCR)
Mol. Mass.:
41920.63
Organism:
Homo sapiens (Human)
Description:
Receptor binding assays were performed using human clone stably expressed in CHO cells.
Residue:
377
  
Inhibitor
Name:
BDBM50413694
Synonyms:
CHEMBL459061
Type:
Small organic molecule
Emp. Form.:
C29H37N3O
Mol. Mass.:
443.6236
SMILES:
Cc1ccc2c(OCCN3CCC(Cc4cccc(c4)N4CCCCC4)CC3)cccc2n1
: