Target
5-hydroxytryptamine receptor 7
Ligand
BDBM50375975
Substrate
Meas. Tech.
ChEMBL_521562 (CHEMBL1000710)
IC50
109.9±n/a nM
Citation
 Jalali-Heravi, MAsadollahi-Baboli, M Quantitative structure-activity relationship study of serotonin (5-HT7) receptor inhibitors using modified ant colony algorithm and adaptive neuro-fuzzy interference system (ANFIS). Eur J Med Chem 44:1463-70 (2009)  
Target
Name:
5-hydroxytryptamine receptor 7
Synonyms:
5-HT-7 5-HT7 5-HT7S 5HT7 HTR7 | Serotonin receptor 7
Type:
G Protein-Coupled Receptor (GPCR)
Mol. Mass.:
53573.08
Organism:
Homo sapiens (Human)
Description:
P34969
Residue:
479
  
Inhibitor
Name:
BDBM50375975
Synonyms:
CHEMBL260073
Type:
Small organic molecule
Emp. Form.:
C29H30ClN5O2
Mol. Mass.:
516.034
SMILES:
Clc1cccc(c1)N1CCN(CCCC(=O)NCc2nc3ccccc3c(=O)n2-c2ccccc2)CC1
: