Target
Sodium channel protein type 4 subunit alpha
Ligand
BDBM50413852
Substrate
Meas. Tech.
ChEMBL_521570 (CHEMBL1004181)
EC50
10000±n/a nM
Citation
 Carrieri, AMuraglia, MCorbo, FPacifico, C 2D- and 3D-QSAR of tocainide and mexiletine analogues acting as Na(v)1.4 channel blockers. Eur J Med Chem 44:1477-85 (2009)  
Target
Name:
Sodium channel protein type 4 subunit alpha
Synonyms:
SCN4A SkM1 Sodium channel protein skeletal muscle subunit alpha Sodium channel protein type IV alpha subunit Voltage-gated sodium channel subunit alpha Nav1.4 | Voltage-gated sodium channel subunit alpha Nav1.4 (Nav1.4)
Type:
Protein
Mol. Mass.:
208010.01
Organism:
Homo sapiens (Human)
Description:
P35499
Residue:
1836
  
Inhibitor
Name:
BDBM50413852
Synonyms:
CHEMBL485003
Type:
Small organic molecule
Emp. Form.:
C20H24N2O
Mol. Mass.:
308.4174
SMILES:
Cc1cccc(C)c1NC(=O)[C@@H]1CCCN1Cc1ccccc1
: