Target
Serine/threonine-protein kinase Chk1
Ligand
BDBM50414082
Substrate
Meas. Tech.
ChEMBL_570759 (CHEMBL1026934)
Ki
3.2±n/a nM
Citation
 Brown, SPMuchmore, SW Large-scale application of high-throughput molecular mechanics with Poisson-Boltzmann surface area for routine physics-based scoring of protein-ligand complexes. J Med Chem 52:3159-65 (2009)  
Target
Name:
Serine/threonine-protein kinase Chk1
Synonyms:
CHEK1 CHK1 checkpoint homolog Checkpoint kinase-1 (CHK1)
Type:
Enzyme Catalytic Domain
Mol. Mass.:
54443.02
Organism:
Homo sapiens (Human)
Description:
gi_166295192
Residue:
476
  
Inhibitor
Name:
BDBM50414082
Synonyms:
CHEMBL550209
Type:
Small organic molecule
Emp. Form.:
C16H15ClN6O
Mol. Mass.:
342.783
SMILES:
Clc1ccc(N2CCCC2)c(NC(=O)Nc2cnc(cn2)C#N)c1
: