Target
Urokinase-type plasminogen activator
Ligand
BDBM50147093
Substrate
Meas. Tech.
ChEMBL_570757 (CHEMBL1026932)
Ki
0.630957±n/a nM
Citation
 Brown, SPMuchmore, SW Large-scale application of high-throughput molecular mechanics with Poisson-Boltzmann surface area for routine physics-based scoring of protein-ligand complexes. J Med Chem 52:3159-65 (2009)  
Target
Name:
Urokinase-type plasminogen activator
Synonyms:
3.4.21.73 U-plasminogen activator Urokinase Urokinase-type plasminogen activator chain B Urokinase-type plasminogen activator short chain A uPA
Type:
Enzyme
Mol. Mass.:
48528.62
Organism:
Homo sapiens (Human)
Description:
P00749
Residue:
431
  
Inhibitor
Name:
BDBM50147093
Synonyms:
6-Carbamimidoyl-4-(pyrimidin-2-ylamino)-naphthalene-2-carboxylic acid (4-aminomethyl-phenyl)-amide CHEMBL104166 | N-(4-(aminomethyl)phenyl)-6-carbamimidoyl-4-(pyrimidin-2-ylamino)-2-naphthamide
Type:
Small organic molecule
Emp. Form.:
C23H21N7O
Mol. Mass.:
411.4591
SMILES:
NCc1ccc(NC(=O)c2cc(Nc3ncccn3)c3cc(ccc3c2)C(N)=N)cc1
: