Target
Urokinase-type plasminogen activator
Ligand
BDBM50147085
Substrate
Meas. Tech.
ChEMBL_570757 (CHEMBL1026932)
Ki
631±n/a nM
Citation
 Brown, SPMuchmore, SW Large-scale application of high-throughput molecular mechanics with Poisson-Boltzmann surface area for routine physics-based scoring of protein-ligand complexes. J Med Chem 52:3159-65 (2009)  
Target
Name:
Urokinase-type plasminogen activator
Synonyms:
PLAU UROK_HUMAN Urokinase-type plasminogen activator (uPA) | Urokinase-type plasminogen activator/surface receptor
Type:
Enzyme
Mol. Mass.:
48528.62
Organism:
Homo sapiens (Human)
Description:
P00749
Residue:
431
  
Inhibitor
Name:
BDBM50147085
Synonyms:
7-METHOXY-8-[1-(METHYLSULFONYL)-1H-PYRAZOL-4-YL]NAPHTHALENE-2-CARBOXIMIDAMIDE 8-(1-Methanesulfonyl-1H-pyrazol-4-yl)-7-methoxy-naphthalene-2-carboxamidine uPa_13
Type:
Small organic molecule
Emp. Form.:
C16H16N4O3S
Mol. Mass.:
344.388
SMILES:
COc1ccc2ccc(cc2c1-c1cnn(c1)S(C)(=O)=O)C(N)=N
: