Target
D(2) dopamine receptor
Ligand
BDBM50414566
Substrate
Meas. Tech.
ChEMBL_582204 (CHEMBL1059864)
Ki
125.89±n/a nM
Citation
 Holmes, IPMicheli, FGaines, SLorthioir, OWatson, SPFabio, RDGentile, GHeidbreder, CSavoia, CWorby, A Dopamine D3 receptor antagonists: the quest for a potentially selective PET ligand. Part one: lead identification. Bioorg Med Chem Lett 19:4799-801 (2009)  
Target
Name:
D(2) dopamine receptor
Synonyms:
D(2) dopamine receptor DOPAMINE D2 Long DRD2 Dopamine D2 receptor Dopamine D2 receptor (D2R) Dopamine2-like | d2
Type:
Cell-surface receptors
Mol. Mass.:
50647.10
Organism:
Homo sapiens (Human)
Description:
P14416
Residue:
443
  
Inhibitor
Name:
BDBM50414566
Synonyms:
CHEMBL563435
Type:
Small organic molecule
Emp. Form.:
C23H35N3O2
Mol. Mass.:
385.5429
SMILES:
COc1cccc(c1)N1CCN(CCN(C)C[C@@]23CC[C@@H](CC2)C3(C)C)C1=O
: