Target
D(3) dopamine receptor
Ligand
BDBM50414577
Substrate
Meas. Tech.
ChEMBL_582203 (CHEMBL1059863)
Ki
125.89±n/a nM
Citation
 Holmes, IPMicheli, FGaines, SLorthioir, OWatson, SPFabio, RDGentile, GHeidbreder, CSavoia, CWorby, A Dopamine D3 receptor antagonists: the quest for a potentially selective PET ligand. Part one: lead identification. Bioorg Med Chem Lett 19:4799-801 (2009)  
Target
Name:
D(3) dopamine receptor
Synonyms:
DOPAMINE D3 DRD3_HUMAN Dopamine D3 receptor (D3) Dopamine receptor Dopamine receptor D3
Type:
Mol. Mass.:
44243.43
Organism:
Homo sapiens (Human)
Description:
Residue:
400
  
Inhibitor
Name:
BDBM50414577
Synonyms:
CHEMBL549438
Type:
Small organic molecule
Emp. Form.:
C17H21ClN4O2
Mol. Mass.:
348.827
SMILES:
CN(CCN1CCN(C1=O)c1cccc(Cl)c1)Cc1cc(C)no1
: