Target
Cathepsin L2
Ligand
BDBM50414642
Substrate
Meas. Tech.
ChEMBL_581586 (CHEMBL1062473)
IC50
7.94±n/a nM
Citation
 Bethel, PAGerhardt, SJones, EVKenny, PWKaroutchi, GIMorley, ADOldham, KRankine, NAugustin, MKrapp, SSimader, HSteinbacher, S Design of selective Cathepsin inhibitors. Bioorg Med Chem Lett 19:4622-5 (2009)  
Target
Name:
Cathepsin L2
Synonyms:
CATL2 CTSL2 CTSV Cathepsin V
Type:
Enzyme
Mol. Mass.:
37341.06
Organism:
Homo sapiens (Human)
Description:
O60911
Residue:
334
  
Inhibitor
Name:
BDBM50414642
Synonyms:
CHEMBL549791
Type:
Small organic molecule
Emp. Form.:
C23H27N7O4
Mol. Mass.:
465.505
SMILES:
Cn1nc(cc1C(=O)NC(Cc1cccc(c1)-c1nnc(CO)o1)C(=O)NCC#N)C(C)(C)C
: