Target
Cathepsin L2
Ligand
BDBM50414639
Substrate
Meas. Tech.
ChEMBL_581586 (CHEMBL1062473)
IC50
6.31±n/a nM
Citation
 Bethel, PAGerhardt, SJones, EVKenny, PWKaroutchi, GIMorley, ADOldham, KRankine, NAugustin, MKrapp, SSimader, HSteinbacher, S Design of selective Cathepsin inhibitors. Bioorg Med Chem Lett 19:4622-5 (2009)  
Target
Name:
Cathepsin L2
Synonyms:
CATL2 CTSL2 CTSV Cathepsin V
Type:
Enzyme
Mol. Mass.:
37341.06
Organism:
Homo sapiens (Human)
Description:
O60911
Residue:
334
  
Inhibitor
Name:
BDBM50414639
Synonyms:
CHEMBL550872
Type:
Small organic molecule
Emp. Form.:
C23H27N7O3
Mol. Mass.:
449.5056
SMILES:
Cc1nnc(o1)-c1cccc(CC(NC(=O)c2cc(nn2C)C(C)(C)C)C(=O)NCC#N)c1
: