Target
Coproporphyrinogen III oxidase
Ligand
BDBM50414824
Substrate
Meas. Tech.
ChEMBL_588025 (CHEMBL1048360)
Ki
39.81±n/a nM
Citation
 Zhang, LHao, GFTan, YXi, ZHuang, MZYang, GF Bioactive conformation analysis of cyclic imides as protoporphyrinogen oxidase inhibitor by combining DFT calculations, QSAR and molecular dynamic simulations. Bioorg Med Chem 17:4935-42 (2009)  
Target
Name:
Coproporphyrinogen III oxidase
Synonyms:
CGOX_BACSU Protoporphyrinogen oxidase hemG | hemY
Type:
PROTEIN
Mol. Mass.:
51210.88
Organism:
Bacillus subtilis (strain 168)
Description:
ChEMBL_588025
Residue:
470
  
Inhibitor
Name:
BDBM50414824
Synonyms:
CHEMBL573882
Type:
Small organic molecule
Emp. Form.:
C20H19FN2O6
Mol. Mass.:
402.3731
SMILES:
COC(=O)CN1C(=O)C(C)Oc2cc(F)c(cc12)N1C(=O)C2=C(CCCC2)C1=O
: