Target
Monoglyceride lipase
Ligand
BDBM50414919
Substrate
Meas. Tech.
ChEMBL_592875 (CHEMBL1046620)
IC50
109.65±n/a nM
Citation
 Kapanda, CNMuccioli, GGLabar, GPoupaert, JHLambert, DM Bis(dialkylaminethiocarbonyl)disulfides as potent and selective monoglyceride lipase inhibitors. J Med Chem 52:7310-4 (2009)  
Target
Name:
Monoglyceride lipase
Synonyms:
HU-K5 Lysophospholipase-like MGL MGLL_HUMAN
Type:
Hydrolase
Mol. Mass.:
33264.56
Organism:
Homo sapiens (Human)
Description:
Human recombinant MGL (Cayman Chemical, cat# 10008354).
Residue:
303
  
Inhibitor
Name:
BDBM50414919
Synonyms:
CHEMBL571699
Type:
Small organic molecule
Emp. Form.:
C12H22N4S4
Mol. Mass.:
350.59
SMILES:
CN1CCN(CC1)C(=S)SSC(=S)N1CCN(C)CC1
: