Target
C-C chemokine receptor type 8
Ligand
BDBM50414966
Substrate
Meas. Tech.
ChEMBL_594037 (CHEMBL1045844)
IC50
14.79±n/a nM
Citation
 Shamovsky, Ide Graaf, CAlderin, LBengtsson, MBladh, HBörjesson, LConnolly, SDyke, HJvan den Heuvel, MJohansson, HJosefsson, BGKristoffersson, ALinnanen, TLisius, AMännikkö, RNordén, BPrice, SRipa, LRognan, DRosendahl, ASkrinjar, MUrbahns, K Increasing selectivity of CC chemokine receptor 8 antagonists by engineering nondesolvation related interactions with the intended and off-target binding sites. J Med Chem 52:7706-23 (2009)  
Target
Name:
C-C chemokine receptor type 8
Synonyms:
CCR8 CKRL1 CMKBRL2
Type:
PROTEIN
Mol. Mass.:
40855.53
Organism:
Homo sapiens (Human)
Description:
ChEMBL_454278
Residue:
355
  
Inhibitor
Name:
BDBM50414966
Synonyms:
CHEMBL573216
Type:
Small organic molecule
Emp. Form.:
C28H32N4O3
Mol. Mass.:
472.5787
SMILES:
COc1ccccc1Oc1ccccc1CN1CCC2(CC1)CCN(CC2)C(=O)c1ccncn1
: