Target
Progesterone receptor
Ligand
BDBM50415020
Substrate
Meas. Tech.
ChEMBL_600189 (CHEMBL1045526)
IC50
2.51±n/a nM
Citation
 Wang, YDuraiswami, CMadauss, KPTran, TBWilliams, SPDeng, SJGraybill, TLHammond, MJones, DGGrygielko, ETBray, JDThompson, SK 2-Amino-9-aryl-3-cyano-4-methyl-7-oxo-6,7,8,9-tetrahydropyrido[2',3':4,5]thieno[2,3-b]pyridine derivatives as selective progesterone receptor agonists. Bioorg Med Chem Lett 19:4916-9 (2009)  
Target
Name:
Progesterone receptor
Synonyms:
NR3C3 PGR PRGR_HUMAN | progesterone
Type:
Protein
Mol. Mass.:
98979.52
Organism:
Homo sapiens (Human)
Description:
P06401
Residue:
933
  
Inhibitor
Name:
BDBM50415020
Synonyms:
CHEMBL570708
Type:
Small organic molecule
Emp. Form.:
C18H11Cl2N3OS
Mol. Mass.:
388.27
SMILES:
Cc1c(C#N)c(Cl)nc2c3C(CC(=O)Nc3sc12)c1ccccc1Cl
: