Target
Androgen receptor
Ligand
BDBM50415099
Substrate
Meas. Tech.
ChEMBL_597011 (CHEMBL1041855)
EC50
15.85±n/a nM
Citation
 Schlienger, NLund, BWPawlas, JBadalassi, FBertozzi, FLewinsky, RFejzic, AThygesen, MBTabatabaei, ABradley, SRGardell, LRPiu, FOlsson, R Synthesis, structure-activity relationships, and characterization of novel nonsteroidal and selective androgen receptor modulators. J Med Chem 52:7186-91 (2009)  
Target
Name:
Androgen receptor
Synonyms:
ANDR_MOUSE Nr3c4
Type:
PROTEIN
Mol. Mass.:
98196.62
Organism:
Mus musculus
Description:
ChEMBL_945930
Residue:
899
  
Inhibitor
Name:
BDBM50415099
Synonyms:
CHEMBL569985
Type:
Small organic molecule
Emp. Form.:
C21H24N2O
Mol. Mass.:
320.4281
SMILES:
CCCC1(O)C[C@H]2CC[C@H](C1)N2c1ccc(C#N)c2ccccc12
: