Target
Muscarinic acetylcholine receptor M3
Ligand
BDBM50415153
Substrate
Meas. Tech.
ChEMBL_596257 (CHEMBL1048033)
Ki
1.51±n/a nM
Citation
 Scapecchi, SNesi, MMatucci, RBellucci, CBuccioni, MDei, SGuandalini, LManetti, DMartelli, CMartini, EMarucci, GOrlandi, FRomanelli, MNTeodori, ECirilli, R Synthesis, affinity profile and functional activity of potent chiral muscarinic antagonists with a pyrrolidinylfuran structure. J Med Chem 53:201-7 (2010)  
Target
Name:
Muscarinic acetylcholine receptor M3
Synonyms:
ACM3_HUMAN Cholinergic, muscarinic M3 Muscarinic receptor M3 | RecName: Full=Muscarinic acetylcholine receptor M3
Type:
Enzyme
Mol. Mass.:
66151.03
Organism:
Homo sapiens (Human)
Description:
P20309
Residue:
590
  
Inhibitor
Name:
BDBM50415153
Synonyms:
CHEMBL569307
Type:
Small organic molecule
Emp. Form.:
C23H32NO2
Mol. Mass.:
354.5051
SMILES:
C[N+]1(C)CCC[C@@H]1c1ccc(o1)[C@@](O)(C1CCCCC1)c1ccccc1
: