Target
Muscarinic acetylcholine receptor M5
Ligand
BDBM50415143
Substrate
Meas. Tech.
ChEMBL_596259 (CHEMBL1048035)
Ki
97.72±n/a nM
Citation
 Scapecchi, SNesi, MMatucci, RBellucci, CBuccioni, MDei, SGuandalini, LManetti, DMartelli, CMartini, EMarucci, GOrlandi, FRomanelli, MNTeodori, ECirilli, R Synthesis, affinity profile and functional activity of potent chiral muscarinic antagonists with a pyrrolidinylfuran structure. J Med Chem 53:201-7 (2010)  
Target
Name:
Muscarinic acetylcholine receptor M5
Synonyms:
ACM5_HUMAN | CHRM5
Type:
PROTEIN
Mol. Mass.:
60102.35
Organism:
Homo sapiens (Human)
Description:
ChEMBL_1517990
Residue:
532
  
Inhibitor
Name:
BDBM50415143
Synonyms:
CHEMBL576663
Type:
Small organic molecule
Emp. Form.:
C22H23NO2
Mol. Mass.:
333.4235
SMILES:
CN1CCCC1c1ccc(o1)C(O)(c1ccccc1)c1ccccc1
: