Target
Histamine H4 receptor
Ligand
BDBM50033330
Substrate
Meas. Tech.
ChEMBL_613511 (CHEMBL1072277)
Ki
1071.52±n/a nM
Citation
 Smits, RAAdami, MIstyastono, EPZuiderveld, OPvan Dam, CMde Kanter, FJJongejan, ACoruzzi, GLeurs, Rde Esch, IJ Synthesis and QSAR of quinazoline sulfonamides as highly potent human histamine H4 receptor inverse agonists. J Med Chem 53:2390-400 (2010)  
Target
Name:
Histamine H4 receptor
Synonyms:
AXOR35 GPCR105 HH4R HRH4 Histamine H4 receptor Histamine receptor (H3 and H4) SP9144
Type:
G Protein-Coupled Receptor (GPCR)
Mol. Mass.:
44517.02
Organism:
Homo sapiens (Human)
Description:
Binding assays were using CHO cells stably expressing hH4R receptors.
Residue:
390
  
Inhibitor
Name:
BDBM50033330
Synonyms:
Benzyl-[2-(4-methyl-piperazin-1-yl)-quinazolin-4-yl]-amine N-benzyl-2-(4-methylpiperazin-1-yl)quinazolin-4-amine | VUF-10246
Type:
Small organic molecule
Emp. Form.:
C20H23N5
Mol. Mass.:
333.4301
SMILES:
CN1CCN(CC1)c1nc(NCc2ccccc2)c2ccccc2n1
: