Target
Histamine H4 receptor
Ligand
BDBM50412502
Substrate
Meas. Tech.
ChEMBL_613511 (CHEMBL1072277)
Ki
630.96±n/a nM
Citation
 Smits, RAAdami, MIstyastono, EPZuiderveld, OPvan Dam, CMde Kanter, FJJongejan, ACoruzzi, GLeurs, Rde Esch, IJ Synthesis and QSAR of quinazoline sulfonamides as highly potent human histamine H4 receptor inverse agonists. J Med Chem 53:2390-400 (2010)  
Target
Name:
Histamine H4 receptor
Synonyms:
AXOR35 GPCR105 HH4R HRH4 Histamine H4 receptor Histamine receptor (H3 and H4) SP9144
Type:
G Protein-Coupled Receptor (GPCR)
Mol. Mass.:
44517.02
Organism:
Homo sapiens (Human)
Description:
Binding assays were using CHO cells stably expressing hH4R receptors.
Residue:
390
  
Inhibitor
Name:
BDBM50412502
Synonyms:
CHEMBL488885 | VUF-10459
Type:
Small organic molecule
Emp. Form.:
C15H21N5
Mol. Mass.:
271.3607
SMILES:
CNc1nc(nc2cccc(C)c12)N1CCN(C)CC1
: