Target
Potassium voltage-gated channel subfamily KQT member 2/3
Ligand
BDBM50415515
Substrate
Meas. Tech.
ChEMBL_612957 (CHEMBL1070909)
EC50
2700±n/a nM
Citation
 Fritch, PCMcNaughton-Smith, GAmato, GSBurns, JFEargle, CWRoeloffs, RHarrison, WJones, LWickenden, AD Novel KCNQ2/Q3 agonists as potential therapeutics for epilepsy and neuropathic pain. J Med Chem 53:887-96 (2010)  
Target
Name:
Potassium voltage-gated channel subfamily KQT member 2/3
Synonyms:
Voltage-gated potassium channel subunit Kv7.2/Kv7.3 | Voltage-gated potassium channel, KQT; KCNQ2(Kv7.2)/KCNQ3(Kv7.3)
Type:
Mol. Mass.:
Description:
ASSAY_ID of EBI is 91707
Components:
This complex has 3 components.
Component 1
Name:
Potassium voltage-gated channel subfamily KQT member 2
Synonyms:
KCNQ (Kv7) potassium channel KCNQ2_HUMAN Neuroblastoma-specific potassium channel subunit alpha KvLQT2 Voltage-gated potassium channel subunit Kv7.2
Type:
PROTEIN
Mol. Mass.:
95883.20
Organism:
Homo sapiens (Human)
Description:
ChEMBL_1457496
Residue:
872
  
Component 2
Name:
Potassium voltage-gated channel subfamily KQT member 3
Synonyms:
KCNQ (Kv7) potassium channel KCNQ3_HUMAN | Voltage-gated potassium channel subunit Kv7.3
Type:
PROTEIN
Mol. Mass.:
96759.41
Organism:
Homo sapiens (Human)
Description:
ChEMBL_938652
Residue:
872
  
Inhibitor
Name:
BDBM50415515
Synonyms:
CHEMBL603874
Type:
Small organic molecule
Emp. Form.:
C19H23N3O2
Mol. Mass.:
325.4048
SMILES:
Cn1c2ccccc2o\c1=N/NC(=O)C12CC3CC(CC(C3)C1)C2
: